Issue #345: Error while building 20150902 develop branch in Qt (dismine/valentina)


#1

New issue 345: Error while building 20150902 develop branch in Qt https://bitbucket.org/valentinateam/valentina/issues/345/error-while-building-20150902-develop

Susan Spencer:

On Windows 8.1, 64bit, using Qt5.4.1 this error occurred when compiling:

-I"C:\Qt5.4\5.4\mingw491_32\include\QtNetwork" -I"C:\Qt5.4\5.4\mingw491_32\include\QtCore" -I"moc" -I"uic" -I"C:\Qt5.4\5.4\mingw491_32\mkspecs\win32-g++" -o obj\vtooloptionspropertybrowser.o …\valentina\src\app\valentina\core\vtooloptionspropertybrowser.cpp In file included from …\valentina\src\app\valentina/…/…/libs/vtools/tools/drawTools/toolpoint/toolsinglepoint/toollinepoint/…/…/…/…/…/…/vpatterndb/variables/vmeasurement.h:32:0, from …\valentina\src\app\valentina/…/…/libs/vtools/tools/drawTools/toolpoint/toolsinglepoint/toollinepoint/…/…/…/…/…/…/vpatterndb/variables.h:33, from …\valentina\src\app\valentina/…/…/libs/vtools/tools/drawTools/toolpoint/toolsinglepoint/toollinepoint/…/…/…/…/…/…/vpatterndb/vcontainer.h:32, from …\valentina\src\app\valentina/…/…/libs/vtools/tools/drawTools/toolpoint/toolsinglepoint/toollinepoint/…/…/…/…/vdatatool.h:32, from …\valentina\src\app\valentina/…/…/libs/vtools/tools/drawTools/toolpoint/toolsinglepoint/toollinepoint/…/…/…/…/vabstracttool.h:32, from …\valentina\src\app\valentina/…/…/libs/vtools/tools/drawTools/toolpoint/toolsinglepoint/toollinepoint/…/…/…/vdrawtool.h:32, from …\valentina\src\app\valentina/…/…/libs/vtools/tools/drawTools/toolpoint/toolsinglepoint/toollinepoint/…/…/vabstractpoint.h:32, from …\valentina\src\app\valentina/…/…/libs/vtools/tools/drawTools/toolpoint/toolsinglepoint/toollinepoint/…/vtoolsinglepoint.h:32, from …\valentina\src\app\valentina/…/…/libs/vtools/tools/drawTools/toolpoint/toolsinglepoint/toollinepoint/vtoollinepoint.h:32, from …\valentina\src\app\valentina/…/…/libs/vtools/tools/drawTools/toolpoint/toolsinglepoint/toollinepoint/vtoolalongline.h:32, from …\valentina\src\app\valentina/…/…/libs/vtools/tools/drawTools/drawtools.h:32, from …\valentina\src\app\valentina\core\vtooloptionspropertybrowser.cpp:30: …\valentina\src\app\valentina/…/…/libs/vtools/tools/drawTools/toolpoint/toolsinglepoint/toollinepoint/…/…/…/…/…/…/vpatterndb/variables/vvariable.h:32:31: fatal error: vinternalvariable.h: No such file or directory #include “vinternalvariable.h” ^ compilation terminated. Makefile:10605: recipe for target ‘obj/vtooloptionspropertybrowser.o’ failed mingw32-make[3]: *** [obj/vtooloptionspropertybrowser.o] Error 1 mingw32-make[3]: Leaving directory ‘C:/Users/Susan/src/build-Valentina-Desktop_Qt_5_4_1_MinGW_32bit-Release/src/app/valentina’ Makefile:39: recipe for target ‘sub-valentina-make_first’ failed mingw32-make[2]: Leaving directory ‘C:/Users/Susan/src/build-Valentina-Desktop_Qt_5_4_1_MinGW_32bit-Release/src/app’ mingw32-make[2]: *** [sub-valentina-make_first] Error 2 Makefile:65: recipe for target ‘sub-app-make_first’ failed mingw32-make[1]: *** [sub-app-make_first] Error 2 mingw32-make[1]: Leaving directory ‘C:/Users/Susan/src/build-Valentina-Desktop_Qt_5_4_1_MinGW_32bit-Release/src’ makefile:38: recipe for target ‘sub-src-make_first’ failed mingw32-make: *** [sub-src-make_first] Error 2 14:57:40: The process “C:\Qt5.4\Tools\mingw491_32\bin\mingw32-make.exe” exited with code 2. Error while building/deploying project Valentina (kit: Desktop Qt 5.4.1 MinGW 32bit) When executing step “Make” 14:57:40: Elapsed time: 44:12.