Issue #344: Error while building 20150828 #2 (dismine/valentina)


#1

New issue 344: Error while building 20150828 #2 https://bitbucket.org/valentinateam/valentina/issues/344/error-while-building-20150828-2

Susan Spencer:

Error while building 20150828 develop branch on Win8.1, 64bit, Qt5.4.1:

g++ -c -include obj\stable.h -pipe -fno-keep-inline-dllexport -fno-omit-frame-pointer -O2 -g -gdwarf-3 -std=c++0x -frtti -Wall -Wextra -fexceptions -mthreads -DUNICODE -DQT_MESSAGELOGCONTEXT -DV_NO_ASSERT -DLATEST_TAG_DISTANCE=272 -DBUILD_REVISION=“735a28e252c5” -DQT_NO_DEBUG -DQT_SVG_LIB -DQT_PRINTSUPPORT_LIB -DQT_WIDGETS_LIB -DQT_GUI_LIB -DQT_XML_LIB -DQT_XMLPATTERNS_LIB -DQT_NETWORK_LIB -DQT_CORE_LIB -DQT_NEEDS_QMAIN -I"…\valentina\src\app\valentina" -I"." -I"…\valentina\src\libs\vtools" -I"…\libs\vtools\uic" -I"…\valentina\src\libs\vwidgets" -I"…\valentina\src\libs\vformat" -I"…\valentina\src\libs\vpatterndb" -I"…\valentina\src\libs\vgeometry" -I"…\valentina\src\libs\ifc" -I"…\valentina\src\libs\vmisc" -I"…\valentina\src\libs\vobj" -I"…\valentina\src\libs\vlayout" -I"…\valentina\src\libs\qmuparser" -I"…\valentina\src\libs\vpropertyexplorer" -I"C:\Q t5.4\5.4\mingw491_32\include" -I"C:\Qt5.4\5.4\mingw491_32\include\QtSvg" -I"C:\Qt5.4\5.4\mingw491_32\include\QtPrintSupport" -I"C:\Qt5.4\5.4\mingw491_32\include\QtWidgets" -I"C:\Qt5.4\5.4\mingw491_32\include\QtGui" -I"C:\Qt5.4\5.4\mingw491_32\include\QtXml" -I"C:\Qt5.4\5.4\mingw491_32\include\QtXmlPatterns" -I"C:\Qt5.4\5.4\mingw491_32\include\QtNetwork" -I"C:\Qt5.4\5.4\mingw491_32\include\QtCore" -I"moc" -I"uic" -I"C:\Qt5.4\5.4\mingw491_32\mkspecs\win32-g++" -o obj\vtooloptionspropertybrowser.o …\valentina\src\app\valentina\core\vtooloptionspropertybrowser.cpp In file included from …\valentina\src\app\valentina/…/…/libs/vtools/tools/drawTools/toolpoint/toolsinglepoint/toollinepoint/…/…/…/…/…/…/vpatterndb/variables/vmeasurement.h:32:0, from …\valentina\src\app\valentina/…/…/libs/vtools/tools/drawTools/toolpoint/toolsinglepoint/toollinepoint/…/…/…/…/…/…/vpatterndb/variables.h:33, from …\valentina\src\app\valentina/…/…/libs/vtools/tools/drawTools/toolpoint/toolsinglepoint/toollinepoint/…/…/…/…/…/…/vpatterndb/vcontainer.h:32, from …\valentina\src\app\valentina/…/…/libs/vtools/tools/drawTools/toolpoint/toolsinglepoint/toollinepoint/…/…/…/…/vdatatool.h:32, from …\valentina\src\app\valentina/…/…/libs/vtools/tools/drawTools/toolpoint/toolsinglepoint/toollinepoint/…/…/…/…/vabstracttool.h:32, from …\valentina\src\app\valentina/…/…/libs/vtools/tools/drawTools/toolpoint/toolsinglepoint/toollinepoint/…/…/…/vdrawtool.h:32, from …\valentina\src\app\valentina/…/…/libs/vtools/tools/drawTools/toolpoint/toolsinglepoint/toollinepoint/…/…/vabstractpoint.h:32, from …\valentina\src\app\valentina/…/…/libs/vtools/tools/drawTools/toolpoint/toolsinglepoint/toollinepoint/…/vtoolsinglepoint.h:32, from …\valentina\src\app\valentina/…/…/libs/vtools/tools/drawTools/toolpoint/toolsinglepoint/toollinepoint/vtoollinepoint.h:32, from …\valentina\src\app\valentina/…/…/libs/vtools/tools/drawTools/toolpoint/toolsinglepoint/toollinepoint/vtoolalongline.h:32, from …\valentina\src\app\valentina/…/…/libs/vtools/tools/drawTools/drawtools.h:32, from …\valentina\src\app\valentina\core\vtooloptionspropertybrowser.cpp:30: …\valentina\src\app\valentina/…/…/libs/vtools/tools/drawTools/toolpoint/toolsinglepoint/toollinepoint/…/…/…/…/…/…/vpatterndb/variables/vvariable.h:32:31: fatal error: vinternalvariable.h: No such file or directory #include “vinternalvariable.h” ^ compilation terminated. Makefile:10605: recipe for target ‘obj/vtooloptionspropertybrowser.o’ failed mingw32-make[3]: *** [obj/vtooloptionspropertybrowser.o] Error 1 mingw32-make[3]: Leaving directory ‘C:/Users/Susan/src/build-Valentina-Desktop_Qt_5_4_1_MinGW_32bit-Release/src/app/valentina’ Makefile:39: recipe for target ‘sub-valentina-make_first’ failed mingw32-make[2]: *** [sub-valentina-make_first] Error 2 mingw32-make[2]: Leaving directory ‘C:/Users/Susan/src/build-Valentina-Desktop_Qt_5_4_1_MinGW_32bit-Release/src/app’ Makefile:65: recipe for target ‘sub-app-make_first’ failed mingw32-make[1]: *** [sub-app-make_first] Error 2 mingw32-make[1]: Leaving directory ‘C:/Users/Susan/src/build-Valentina-Desktop_Qt_5_4_1_MinGW_32bit-Release/src’ makefile:38: recipe for target ‘sub-src-make_first’ failed mingw32-make: *** [sub-src-make_first] Error 2 16:56:50: The process “C:\Qt5.4\Tools\mingw491_32\bin\mingw32-make.exe” exited with code 2. Error while building/deploying project Valentina (kit: Desktop Qt 5.4.1 MinGW 32bit) When executing step “Make” 16:56:50: Elapsed time: 45:44.