Issue #343: Error while building 20150828 develop branch in Qt (dismine/valentina)


#1

New issue 343: Error while building 20150828 develop branch in Qt https://bitbucket.org/valentinateam/valentina/issues/343/error-while-building-20150828-develop

Susan Spencer:

While building 20150828 develop branch in Qt on Win8.1, 64bit, Qt5.4.1:

…\valentina\src\libs\vpatterndb" -I"…\valentina\src\libs\vgeometry" -I"…\valentina\src\libs\ifc" -I"…\valentina\src\libs\vmisc" -I"…\valentina\src\libs\vobj" -I"…\valentina\src\libs\vlayout" -I"…\valentina\src\libs\qmuparser" -I"…\valentina\src\libs\vpropertyexplorer" -I"C:\Qt5.4\5.4\mingw491_32\include" -I"C:\Qt5.4\5.4\mingw491_32\include\QtSvg" -I"C:\Qt5.4\5.4\mingw491_32\include\QtPrintSupport" -I"C:\Qt5.4\5.4\mingw491_32\include\QtWidgets" -I"C:\Qt5.4\5.4\mingw491_32\include\QtGui" -I"C:\Qt5.4\5.4\mingw491_32\include\QtXml" -I"C:\Qt5.4\5.4\mingw491_32\include\QtXmlPatterns" -I"C:\Qt5.4\5.4\mingw491_32\include\QtNetwork" -I"C:\Qt5.4\5.4\mingw491_32\include\QtCore" -I"moc" -I"uic" -I"C:\Qt5.4\5.4\mingw491_32\mkspecs\win32-g++" -o obj\vapplication.o …\valentina\src\app\valentina\core\vapplication.cpp …\valentina\src\app\valentina\core\vapplication.cpp: In member function ‘QString VApplication::TapeFilePath() const’: …\valentina\src\app\valentina\core\vapplication.cpp:344:16: error: ‘fileBundle’ was not declared in this scope return fileBundle.absoluteFilePath(); ^ …\valentina\src\app\valentina\core\vapplication.cpp:387:1: warning: control reaches end of non-void function [-Wreturn-type] } ^ Makefile:9862: recipe for target ‘obj/vapplication.o’ failed mingw32-make[3]: *** [obj/vapplication.o] Error 1 mingw32-make[3]: Leaving directory ‘C:/Users/Susan/src/build-Valentina-Desktop_Qt_5_4_1_MinGW_32bit-Release/src/app/valentina’ Makefile:39: recipe for target ‘sub-valentina-make_first’ failed mingw32-make[2]: *** [sub-valentina-make_first] Error 2 mingw32-make[2]: Leaving directory ‘C:/Users/Susan/src/build-Valentina-Desktop_Qt_5_4_1_MinGW_32bit-Release/src/app’ Makefile:65: recipe for target ‘sub-app-make_first’ failed mingw32-make[1]: *** [sub-app-make_first] Error 2 mingw32-make[1]: Leaving directory ‘C:/Users/Susan/src/build-Valentina-Desktop_Qt_5_4_1_MinGW_32bit-Release/src’ makefile:38: recipe for target ‘sub-src-make_first’ failed mingw32-make: *** [sub-src-make_first] Error 2 14:34:44: The process “C:\Qt5.4\Tools\mingw491_32\bin\mingw32-make.exe” exited with code 2. Error while building/deploying project Valentina (kit: Desktop Qt 5.4.1 MinGW 32bit) When executing step “Make” 14:34:44: Elapsed time: 41:19.